[Solved] rk3588_buildroot Compile Error: ERROR: Running build_kernel failed!

[Solved] Rk3588_Buildroot Compile Error: Error: Running Build_Kernel Failed!
Error Messages:

#
# No change to .config
#
  CALL    scripts/atomic/check-atomics.sh
  CALL    scripts/checksyscalls.sh
  CHK     embrace/generated/compile.h
deadly: not a git repository (or any of the father or mother directories): .git
  LZ4C    arch/arm64/boot/Image.lz4
Incorrect parameters
Usage :
      lz4 [arg] [input] [output]

enter   : a filename
          with no FILE, or when FILE is - or stdin, learn normal enter
Arguments :
 -1     : Fast compression (default) 
 -9     : High compression 
 -d     : decompression (default for .lz4 extension)
 -z     : drive compression
 -f     : overwrite output with out prompting 
 -h/-H  : show assist/lengthy assist and exit
arch/arm64/boot/Makefile:31: recipe for goal 'arch/arm64/boot/Image.lz4' failed
make[2]: *** [arch/arm64/boot/Image.lz4] Error 1
make[2]: *** Deleting file 'arch/arm64/boot/Image.lz4'
arch/arm64/Makefile:170: recipe for goal 'Image.lz4' failed
make[1]: *** [Image.lz4] Error 2
make[1]: *** Waiting for unfinished jobs....
arch/arm64/Makefile:214: recipe for goal 'rk3588-evb2-lp4-v10-edp-linux.img' failed
make: *** [rk3588-evb2-lp4-v10-edp-linux.img] Error 2
ERROR: Running build_kernel failed!
ERROR: exit code 2 from line 656:
    make ARCH=$RK_ARCH $RK_KERNEL_DTS.img -j$RK_JOBS

Solved Rk3588 Buildroot Compile Error Error Running Build Kernel Failed

1.error
deadly: not a git repository (or any of the father or mother directories): .git
2.resolution
sudo git init

1662389062 883 Solved Rk3588 Buildroot Compile Error Error Running Build Kernel Failed

2.About the lz4 error, I feel the model cannot sustain with it, I used to be solved by the next strategies.
sudo apt-get take away  liblz4-tool
sudo git clone https://github.com/lz4/lz4.git
cd /lz4
sudo make
sudo make set up

1662389067 70 Solved Rk3588 Buildroot Compile Error Error Running Build Kernel Failed

How to bypass warning Unexpected any. Specify a different type @typescript-eslint/no-explicit-any

We Are Going To Discuss About How to bypass warning Unexpected any. Specify a different type @typescript-eslint/no-explicit-any. So lets Start this Article. How to...
Avatar Of Budi Setiawan Budi Setiawan
1 min read

Woocommerce Stripe No such source: ‘src_1HSDYbGnTdOaP0tZcjziW81K’ Error

We Are Going To Discuss About Woocommerce Stripe No such supply: ‘src_1HSDYbGnTdOaP0tZcjziW81K’ Error. So lets Start this Article. Woocommerce Stripe No such supply: ‘src_1HSDYbGnTdOaP0tZcjziW81K’...
Avatar Of Budi Setiawan Budi Setiawan
38 sec read

bazel Compile Error: absl/base/policy_checks.h:79:2: error: #error “C++ versions less than C++14…

An error is reported when compiling a software program utilizing bazel, and the error message is: absl/base/policy_checks.h:79:2: error: #error “C++ versions less than C++14...
Avatar Of Budi Setiawan Budi Setiawan
1 min read

Leave a Reply

Your email address will not be published.